PHIPS
change note: 2020-11-10 13:39:36.0 [tstevens] insert AltLabel (id: null category: primary text: Particle Habit Imaging and Polar Scattering Probe language code: en); insert Definition (id: null text: Particle Habit Imaging and Polar Scattering Probe (PHIPS) is an aircraft probe that measures single cloud particles. language code: en);
change note: 2020-11-10 13:38:02.0 [tstevens] Insert Concept add broader relation (PHIPS [d403d52c-20f2-4c3d-a1e6-164b31f66bdf,560754] - Probes [def72d78-3c2f-4f46-91e7-259a0e63e2de,545971]);
change note: 2020-11-10 13:41:49.0 [tstevens] update Definition (The Particle Habit Imaging and Polar Scattering Probe (PHIPS) is an aircraft probe that measures single cloud particles.);
type: Concept
in scheme: instruments
definition: The Particle Habit Imaging and Polar Scattering Probe (PHIPS) is an aircraft probe that measures single cloud particles.

Probes
type: Concept