WATER VAPOR PROCESSES
type: Concept

SUBLIMATION
change note: 2017-04-21 13:01:50.0 [sritz] update Definition (The process of phase transition from solid directly to vapor in the absence of melting.); update Definition (Glossary of Meteorology, American Meteorological Society);
change note: 2017-04-20 14:11:24.0 [sritz] Move Concepts delete broader relation (null); add broader relation (SUBLIMATION [d438f0a2-5a88-4d56-8bec-7c5e35249544,84653] - WATER VAPOR PROCESSES [3c4fe00c-6fb1-403e-a053-3a0174a6dfe6,278813]);
in scheme: sciencekeywords
definition: The process of phase transition from solid directly to vapor in the absence of melting.
type: Concept