METEORITE ORIGIN
change note: 2013-03-14 14:37:28.0 [tbs1979] insert Definition (id: null text: The origin and characteristics of meteorites within the solid Earth. language code: en);
change note: 2013-03-07 08:08:55.0 [tbs1979] Insert Concept add broader relation (METEORITE ORIGIN [d45ccf89-7f8c-4a61-b46d-c34dca21c879,83089] - METEORITES [96be1efc-d5e2-423d-8ade-00b3d454244d,64711]);
in scheme: sciencekeywords
definition: The origin and characteristics of meteorites within the solid Earth.
type: Concept

METEORITES
type: Concept