USDA
type: Concept

USDA/NRCS/ITC
in scheme: providers
definition: Our Mission is "To lead the development and transfer of water and climate information and technology which support natural resource conservation." With a Vision of the future as "A globally recognized source for a top quality spatial snow, water, climate, and hydrologic network of information and technology." Information provided by: http://www.wcc.nrcs.usda.gov/about/nwcc-function.html
type: Concept