NSF
type: Concept

LTER/NWT
in scheme: providers
definition: The Niwot Ridge (Colorado) Long-Term Ecological Research is the sole alpine tundra site and provides users with ready access to site-based information and data. Data and Information provided includes: -Current Meteorological Data - from the C-1 met station (3022m) -Current Meteorological Data - from the Saddle met station (3528m) -Current Meteorological Data - from the D-1 met station (3739m) -Climate -Geography and Topography -Vegetation -Fauna Website: "http://www.lternet.edu/sites/nwt" [Summary provided by Niwot Ridge LTER.]
type: Concept