MARINE SURFACE DEBRIS
change note: 2021-10-19 08:56:30.0 [tstevens] insert Definition (id: null text: Marine debris detectable on the surface of the ocean. language code: en);
change note: 2021-10-19 08:55:33.0 [tstevens] Insert Concept add broader relation (MARINE SURFACE DEBRIS [d594fc9c-556b-4eb5-9ec3-0d2126ca9cd5,778195] - MARINE SURFACE ELEMENTS [e6c6507d-59dd-49f4-9afa-bb7393a718c6,778193]);
in scheme: sciencekeywords
definition: Marine debris detectable on the surface of the ocean.
type: Concept

MARINE SURFACE ELEMENTS
type: Concept