SEDIMENT CORERS
change note: 2021-08-05 17:08:00.0 [sritz] insert AltLabel (id: null category: primary text: SEDIMENT CORERS language code: en);
in scheme: instruments
definition: A sediment corer is a device to collect undisturbed samples of saturated sands, silts, and sediments. [Summary provided by Rickly Hydrological Company]
type: Concept

Corers
type: Concept