DOE/LLNL/ASD
in scheme: providers
definition: The Atmospheric Science Division (ASD) at Lawrence Livermore National Laboratory (LLNL) perform pioneering research on global climate and chemistry and predict the local, urban, regional, and global transport and fate of hazardous and toxic pollutants. Research is focused on major national energy and security policy issues and is based primarily on development and use of advanced computational simulations of the atmosphere, oceans, and biosphere. Website: "http://eed.llnl.gov/asd/" [Summary provided by LLNL.]
type: Concept

DOE
type: Concept