INFORMATION MANAGEMENT SERVICES
type: Concept

WEB COVERAGE SERVICE
in scheme: sciencekeywords
definition: Retrieves client-specified subset of client-specified coverage (or image) dataset.
type: Concept