Jet
type: Concept

HU-25A
in scheme: platforms
change note: 2021-11-17 09:45:26.0 [tstevens] Cut Concepts delete broader relation (null); add broader relation (HU-25A [d77685bd-aa94-4717-bd97-632699d999b5,826793] - Trash Can/Platforms [6089b3e5-7db9-46e1-b73b-2d679f34abb4,831469]);
change note: 2017-02-08 13:32:22.0 [aaleman] added new platform at request of NSIDC insert AltLabel (id: null text: Dassault HU-25A Guardian language code: en);
change note: 2021-11-17 09:45:39.0 [tstevens] Move Concepts delete broader relation (null); add broader relation (HU-25A [d77685bd-aa94-4717-bd97-632699d999b5,826793] - Jet [5b8e4067-db4e-42d4-b4a5-7de5e683125d,835881]);
change note: 2017-02-08 13:31:23.0 [aaleman] Insert Concept add broader relation (HU-25A [d77685bd-aa94-4717-bd97-632699d999b5,278645] - Aircraft [227d9c3d-f631-402d-84ed-b8c5a562fc27,256457]);
change note: 2022-02-17 09:06:03.0 [tstevens] insert Definition (id: null text: The Dassault HU-25C Guardian is a modified twin-engine business jet, based on the civilian Dassault FA-20G Falcon. The aircraft was previously used by the U.S. Coast Guard as a search-and-rescue platform. NASA acquired this aircraft in 2011 to provide a medium altitude, medium range platform for remote sensing instruments and satellite support. Payload accommodations include a nadir camera port, large search windows on each side of the fuselage, a hard point with pylon under each wing, provisions for mounting atmospheric sampling probes on the crown of the fuselage, and a nadir drop hatch (32 in. long x 19.7 in. wide). language code: en);
type: Concept
definition: The Dassault HU-25C Guardian is a modified twin-engine business jet, based on the civilian Dassault FA-20G Falcon. The aircraft was previously used by the U.S. Coast Guard as a search-and-rescue platform. NASA acquired this aircraft in 2011 to provide a medium altitude, medium range platform for remote sensing instruments and satellite support. Payload accommodations include a nadir camera port, large search windows on each side of the fuselage, a hard point with pylon under each wing, provisions for mounting atmospheric sampling probes on the crown of the fuselage, and a nadir drop hatch (32 in. long x 19.7 in. wide).