DOC/NOAA/NESDIS/OSPO
change note: 2018-02-08 13:25:00.0 [tstevens] update Definition (The Office of Satellite and Product Operations (OSPO) is part of the National Environmental Satellite Data and Information Service (NESDIS). NESDIS is part of the National Oceanic and Atmospheric Administration (NOAA), and the Department of Commerce. OSPO was created by merging the Office of Satellite Data Processing and Distribution (OSDPD) and the Office of Satellite Operations. It is responsible for maintaining the comprehensive scheduling and data information for both Geostationary and Polar orbiting satellites along with providing products derived from the data collected by these satellites); update Definition (); insert Resource (id: null type: provider url: http://www.ospo.noaa.gov/);
change note: 2017-04-12 09:35:12.0 [mgenazzi] Insert Concept add broader relation (DOC/NOAA/NESDIS/OSPO [d7cfdf0b-59cf-4668-aebb-f71233023f74,278793] - NOAA [c9003d36-020d-4e86-995a-498945576c23,249099]);
change note: 2018-02-08 13:15:39.0 [tstevens] insert AltLabel (id: null category: primary text: Office of Satellite and Product Operations, NESDIS, NOAA, U.S. Department of Commerce language code: en);
change note: 2017-04-12 09:37:06.0 [mgenazzi] External request for new keyword insert Definition (id: null text: Office of Satellite and Product Operations, NESDIS, NOAA, U.S. Department of Commerce http://www.ospo.noaa.gov/ The Office of Satellite and Product Operations (OSPO) is part of the National Environmental Satellite Data and Information Service (NESDIS). NESDIS is part of the National Oceanic and Atmospheric Administration (NOAA), and the Department of Commerce. OSPO was created by merging the Office of Satellite Data Processing and Distribution (OSDPD) and the Office of Satellite Operations. It is responsible for maintaining the comprehensive scheduling and data information for both Geostationary and Polar orbiting satellites along with providing products derived from the data collected by these satellites. language code: en);
change note: 2022-12-05 17:23:49.0 [sritz] update Resource (https://www.ospo.noaa.gov/);
type: Concept
in scheme: providers
definition: The Office of Satellite and Product Operations (OSPO) is part of the National Environmental Satellite Data and Information Service (NESDIS). NESDIS is part of the National Oceanic and Atmospheric Administration (NOAA), and the Department of Commerce. OSPO was created by merging the Office of Satellite Data Processing and Distribution (OSDPD) and the Office of Satellite Operations. It is responsible for maintaining the comprehensive scheduling and data information for both Geostationary and Polar orbiting satellites along with providing products derived from the data collected by these satellites

NOAA
type: Concept