KATABATIC WINDS
change note: 2017-04-21 12:33:56.0 [tstevens] insert Definition (id: null text: Most widely used in mountain meteorology to denote a downslope flow driven by cooling at the slope surface during periods of light larger-scale winds; the nocturnal component of the along-slope wind systems. language code: en);
change note: 2017-04-20 15:16:55.0 [sritz] Insert Concept add broader relation (KATABATIC WINDS [d7d48399-62ac-4eca-9c09-14b9094a9444,278909] - OROGRAPHIC WINDS [a1df1d50-dd2b-4944-bda5-0cf1127e2f49,278903]);
in scheme: sciencekeywords
definition: Most widely used in mountain meteorology to denote a downslope flow driven by cooling at the slope surface during periods of light larger-scale winds; the nocturnal component of the along-slope wind systems.
type: Concept

OROGRAPHIC WINDS
type: Concept