V - Z
type: Concept

WALE
in scheme: projects
definition: The Western Arctic Linkage Experiment (WALE) Project was designed to assess the ability of models to simulate water/energy and CO2 exchange with the atmosphere, and freshwater delivery to the ocean for the Alaskan region in the 1980s and 1990s. The primary goal of the study was to better understand uncertainties of simulated regional hydrologic and ecosystem dynamics in the context of 1) uncertainties in the data available to drive the models and 2) different approaches to simulating regional hydrology and ecosystem dynamics. In the WALE special theme of Earth Interactions we report the results of the WALE Project. Information provided by http://ams.allenpress.com/perlserv/?request=get-collection&coll_id=4
type: Concept