CARNIVORES
type: Concept

MARTENS/WEASELS/WOLVERINES
change note: 2017-03-15 09:21:53.0 [mgenazzi] Definition added insert Definition (id: null text: Phylum Chordata. Class Mammalia. Order Carnivora. Family Mustelidae are small carnivorous mammals with short legs, round ears and thick fur. language code: en);
in scheme: sciencekeywords
definition: Phylum Chordata. Class Mammalia. Order Carnivora. Family Mustelidae are small carnivorous mammals with short legs, round ears and thick fur.
type: Concept