SCRIPPS/CALSPACE
in scheme: providers
definition: Earthguide is a web-based teacher's resource in earth and environmental science, oceanography, and related technologies including earth observation via satellite. Topic presentations stress an earth systems approach and highlight linkages between global and local systems. We also highlight ongoing research at Scripps Institution of Oceanography and often work in partnership with the Birch Aquarium at Scripps. Resources are made available through outreach efforts developed with researchers and regional schools. Resources include maps, data, images, animations, expedition coverage, web-based interactivities for students, and more. Our materials evolve with input from teachers and students like you.
type: Concept

CONSORTIA/INSTITUTIONS
type: Concept