CLM-LSM
definition: The Common Land Model (CLM) was developed for community use by a grassroots collaboration of scientists who have an interest in making a general land model available for public use and further development. The major model characteristics include enough unevenly spaced layers to adequately represent soil temperature and soil moisture, and a multilayer parameterization of snow processes; an explicit treatment of the mass of liquid water and ice water and their phase change within the snow and soil system; a runoff parameterization following the TOPMODEL concept; a canopy photo synthesis-conductance model that describes the simultaneous transfer of CO2 and water vapor into and out of vegetation; and a tiled treatment of the subgrid fraction of energy and water balance. CLM has been extensively evaluated in offline mode and coupling runs with the NCAR Community Climate Model (CCM3).
change note: 2022-03-10 08:41:15.0 [tstevens] insert Definition (id: null text: The Common Land Model (CLM) was developed for community use by a grassroots collaboration of scientists who have an interest in making a general land model available for public use and further development. The major model characteristics include enough unevenly spaced layers to adequately represent soil temperature and soil moisture, and a multilayer parameterization of snow processes; an explicit treatment of the mass of liquid water and ice water and their phase change within the snow and soil system; a runoff parameterization following the TOPMODEL concept; a canopy photo synthesis-conductance model that describes the simultaneous transfer of CO2 and water vapor into and out of vegetation; and a tiled treatment of the subgrid fraction of energy and water balance. CLM has been extensively evaluated in offline mode and coupling runs with the NCAR Community Climate Model (CCM3). language code: en);
change note: 2014-05-30 05:15:30.0 [128.183.164.42] SR Added new model. insert AltLabel (id: null text: Common Land Model (CLM) Land Surface Model language code: en);
change note: 2021-11-30 13:37:17.0 [tstevens] Move Concepts delete broader relation (null); add broader relation (CLM-LSM [d8e67ddc-abaf-469b-8e84-f1549c1ca70d,826798] - Models [0a184cdc-c074-4946-90a6-02f03c686341,835911]);
change note: 2014-05-30 05:14:58.0 [128.183.164.42] Insert Concept add broader relation (CLM-LSM [d8e67ddc-abaf-469b-8e84-f1549c1ca70d,106429] - Models [113ecbc2-ab36-4d58-a96c-a6ce0106e749,73395]);
in scheme: platforms
type: Concept

Models
type: Concept