Subsurface
type: Concept

SEASOAR
change note: 2022-02-22 14:10:45.0 [tstevens] update Definition (SeaSoar is a a towed, undulating measurement package. The moveable wings are contolled by a topside computer which sends up-down signals via the conducting tow cable. The wings are moved by a hydraulic unit which is powered by an impeller on the tail of SeaSoar. Data is returned to a topside computer network via the conducting cable.); update Definition (Oregon State University);
change note: 2021-11-18 11:14:47.0 [tstevens] Move Concepts delete broader relation (null); add broader relation (SEASOAR [d975d656-aa72-41fe-857f-1aa15b0543e2,826800] - Subsurface [31eb34c8-016e-48c4-9404-7d94ee66cfde,835901]);
in scheme: platforms
definition: SeaSoar is a a towed, undulating measurement package. The moveable wings are contolled by a topside computer which sends up-down signals via the conducting tow cable. The wings are moved by a hydraulic unit which is powered by an impeller on the tail of SeaSoar. Data is returned to a topside computer network via the conducting cable.
type: Concept