COMMERCIAL
type: Concept

EASY
in scheme: providers
definition: Our Company Easy Software Products is a 14-year old software company located in California that produces the HTMLDOCTM document and report publishing software for Linux®, MacOS X®, Solaris®, and Microsoft Windows®. We focus on creating the most useful and easy-to-use software available, refining our software based on our customers' needs and experiences. Our Software HTMLDOC is used world-wide to create on-line and printable billing, books, financial statements, automated network configuration guides, mailing lists and labels, marketing flyers, quarterly reports, technical manuals, and users manuals. We use HTMLDOC for all of our own books, documentation, and reports, and it is the core of our free PDF-o-matic service. Summary provided by http://www.easysw.com/about.php
type: Concept