SEPS
in scheme: instruments
definition: The Source/Loss-Cone Energetic Particle Spectrometer (SEPS) instrument is located on the POLAR satellite despun platform along with the auroral imagers, and is independent of the other CEPPAD sensors. SEPS consists of two independent telescopes which measure both the energetic electron, and ion fluxes in the vicinity of the magnetic field-aligned loss, and source cone regions with high sensitivity, and with fine angular and time resolution. SEPS consists of two independent telescopes, one for electrons, and one for ions. The electron telescope has twice the sensor area of the ion telescope, and uses aperture wheels to vary its dynamic range. Particle angular imaging is obtained using pinhole-camera apertures in front of the electron XY position sensitive detectors. The ion telescope is similar to the electron telescope except for the reduced sensor area, and the fact that the aperture wheels are replaced by magnets which sweep out electron. See: http://www.css.tayloru.edu/~physics/seps.html for more information. The SEPS is part of the Comprehensive Energetic Particle Pitch Angle Distribution (CEPPADS) package, but the SEPS sensor is independent of the body mounted sensor and contains a separate digital processing unit. See: http://pwg.gsfc.nasa.gov/polar/polar_inst.shtml Group: Instrument_Details Entry_ID: SEPS Group: Instrument_Identification Instrument_Category: Solar/Space Observing Instruments Instrument_Class: Particle Detectors Short_Name: SEPS Long_Name: Source Loss-Cone Energetic Particle Spectrometer End_Group Group: Associated_Platforms Short_Name: POLAR End_Group Online_Resource: http://www.css.taylor.edu/~physics/seps.html Sample_Image: http://www.css.taylor.edu/~physics/seps-1/images/seps_instrument.jpg Group: Instrument_Logistics Instrument_Start_Date: 1996-02-24 Instrument_Owner: Taylor University End_Group End_Group
type: Concept

Particle Detectors
type: Concept