UDEL/RDMS/DGIC/DIME
in scheme: providers
definition: This web-based tool helps you create and modify metadata information for the Delaware Geospatial Data Clearinghouse. The system is based on the Federal Geographic Data Committee (FGDC) metadata standards (Content Standards for Digital Geospatial Metadata). However, the Metadata Entry System only asks you to provide a small number of required information fields, which it then uses to produce a metadata catalog entry. Website: http://www.rdms.udel.edu/fgdc/dime/ Info: University of Delaware
type: Concept

ACADEMIC
type: Concept