SOIL RESPIRATION
in scheme: sciencekeywords
definition: The metabolic process whereby electrons are transfered from a reduced compound (usually organic) to an inorganic acceptor molecule other than oxygen.
type: Concept

SOILS
type: Concept