Kingfisher
change note: 2021-11-18 11:15:15.0 [tstevens] Move Concepts delete broader relation (null); add broader relation (Kingfisher [dba6c8ed-8444-4e18-965c-9c0e30186ac3,826809] - Surface [e634b062-56ba-41a9-9c95-0cff642b5974,835902]);
change note: 2020-03-17 08:21:23.0 [tstevens] insert Definition (id: null text: Kingfisher Unmanned Surface Vessel (USV) is an agile, battery operated boat designed for research and rapid prototyping. Fully equipped with a sensor station, an onboard Atom PC for running hardware drivers and intelligence, electric thrusters, GPS, wifi radio, and semi-planing hulls, Kingfisher serves as a marine research platform as well as a remote survey system for bathymetric and hyrometric data collection. This USV includes advanced payload capabilities, easy stow and portability, and can be easily customized to meet research requirements. language code: en);
change note: 2020-03-17 08:19:43.0 [tstevens] Insert Concept add broader relation (Kingfisher [dba6c8ed-8444-4e18-965c-9c0e30186ac3,559867] - USV [bf17bbac-0fc9-48b3-9b03-bd780ffe1eb0,542539]);
in scheme: platforms
definition: Kingfisher Unmanned Surface Vessel (USV) is an agile, battery operated boat designed for research and rapid prototyping. Fully equipped with a sensor station, an onboard Atom PC for running hardware drivers and intelligence, electric thrusters, GPS, wifi radio, and semi-planing hulls, Kingfisher serves as a marine research platform as well as a remote survey system for bathymetric and hyrometric data collection. This USV includes advanced payload capabilities, easy stow and portability, and can be easily customized to meet research requirements.
type: Concept

Surface
type: Concept