NON-GOVERNMENT/NON-PROFIT ORGANIZATIONS
type: Concept

PWET
in scheme: providers
definition: Since 1984, the Project WET Foundation has dedicated itself to the mission of reaching children, parents, teachers and community members of the world with water education. A 501(c)(3) not-for-profit organization, Project WET achieves its mission of worldwide water education by: publishing water resource materials in several languages. providing training workshops on diverse water topics (e.g., watersheds, water quality, water conservation). organizing community water events, such as Make a Splash with Project WET water festivals and the Global Water Education Village™. building a worldwide network of educators, water resource professionals and scientists. Project WET publications, training workshops, global network and community events are grounded in Project WET’s core beliefs.
type: Concept