SMERGE
change note: 2021-09-07 15:26:40.0 [sritz] insert Definition (id: null text: The SoilMERGE (SMERGE) product combines long-term (January 1979 – May 2019) satellitebased soil moisture retrievals with land surface model estimates acquired from Phase-2 of the North American Land Data Assimilation System (NLDAS-2) to produce a 0.125-degree, daily, root-zone soil moisture (RZMS) product within the conterminous United States (CONUS). This document contains basic information on the use of SMERGE RZSM for large-scale climate and hydrological studies. language code: en);
change note: 2021-11-30 13:23:42.0 [tstevens] Move Concepts delete broader relation (null); add broader relation (SMERGE [dbe12992-5ef4-47d2-b2a4-84a7c28e84f0,826814] - Models [0a184cdc-c074-4946-90a6-02f03c686341,835911]);
change note: 2021-09-07 15:21:48.0 [sritz] insert AltLabel (id: null category: primary text: NLDAS-Noah and ESA-CCI Merged Soil Moisture language code: en);
change note: 2021-09-07 15:18:20.0 [sritz] Insert Concept add broader relation (SMERGE [dbe12992-5ef4-47d2-b2a4-84a7c28e84f0,720886] - Models/Analyses [113ecbc2-ab36-4d58-a96c-a6ce0106e749,711104]);
definition: The SoilMERGE (SMERGE) product combines long-term (January 1979 – May 2019) satellitebased soil moisture retrievals with land surface model estimates acquired from Phase-2 of the North American Land Data Assimilation System (NLDAS-2) to produce a 0.125-degree, daily, root-zone soil moisture (RZMS) product within the conterminous United States (CONUS). This document contains basic information on the use of SMERGE RZSM for large-scale climate and hydrological studies.
in scheme: platforms
type: Concept

Models
type: Concept