USDA
type: Concept

USDA/NRCS/PMP
in scheme: providers
definition: The USDA Plant Monitoring Program includes a network of 26 Plant Materials Centers and associated Plant Materials Specialists serving all 50 states and territories. They select conservation plants and develops innovative planting technology to solve the nation's most important resource concerns. Website: "http://plant-materials.nrcs.usda.gov/" [Summary provided by the USDA.]
type: Concept