ICE MELANGE VELOCITY
change note: 2021-06-15 16:39:26.0 [sritz] insert Definition (id: null text: Dense packs of icebergs and sea ice found in proglacial fjords language code: en);
change note: 2021-06-15 16:36:05.0 [sritz] Insert Concept add broader relation (ICE MELANGE VELOCITY [dcb59899-1b98-478b-b23f-7485f4d93eec,649558] - ICE MELANGE [d7a7e7b7-4084-4a29-a4f0-470ea477b486,649557]);
in scheme: sciencekeywords
definition: Dense packs of icebergs and sea ice found in proglacial fjords
type: Concept

ICE MELANGE
type: Concept