POPULATION
type: Concept

POPULATION SIZE
change note: 2012-07-03 09:12:39.0 [tbs1979] update Definition (The quantity of people living in a particular area.); update Definition (U.S. Census Bureau);
in scheme: sciencekeywords
definition: The quantity of people living in a particular area.
type: Concept