SSP
change note: 2022-01-14 08:35:33.0 [tstevens] Insert Concept add broader relation (SSP [dd1965ee-cf37-4773-81df-a3ec5f97e8a2,836021] - S - U [4eb1894b-35b4-406b-8864-944a42bc7702,829386]);
in scheme: projects
definition: The Shared Socioeconomic Pathways (SSPs) data collection archived and disseminated here includes data sets developed based on SSP qualitative narratives and/or quantitative elements.
type: Concept

S - U
type: Concept