SEA ICE DYNAMICS
change note: 2023-02-24 12:35:10.0 [sritz] update Definition (The drift of sea ice forced by the winds and ocean currents); update Definition (National Snow and Ice Data Center, Distributed Active Archive Center, https://nsidc.org/data/data-programs/nsidc-daac);
change note: 2023-02-24 12:11:40.0 [sritz] insert Definition (id: null text: National Snow and Ice Data Center, Distributed Active Archive Center language code: en);
change note: 2023-02-24 12:10:35.0 [sritz] Insert Concept add broader relation (SEA ICE DYNAMICS [defd2c00-64e3-4986-9061-feade19f972f,1232201] - SEA ICE [d73e969a-4b66-4713-8d63-fa3cbb1e25e3,1228717]);
in scheme: sciencekeywords
definition: The drift of sea ice forced by the winds and ocean currents
type: Concept

SEA ICE
type: Concept