WATER VAPOR INDICATORS
type: Concept

STABLE ISOTOPES
change note: 2018-05-23 18:52:19.0 [sritz] Insert Concept add broader relation (STABLE ISOTOPES [df1a03f5-1cb3-4c63-870a-5a09debdf065,367629] - WATER VAPOR INDICATORS [005d192a-95b9-4fc2-afed-f87da3c3dc33,278815]);
in scheme: sciencekeywords
definition: An isotope of an element that shows no tendency to undergo radioactive breakdown.
type: Concept