CPEX-CV
definition: NASA’s Convective Processes Experiment – Cabo Verde (CPEX-CV) is a continuation of the truncated CPEX – Aerosols and Winds (CPEX-AW) field program flown out of St. Croix, USVI between 17 August – 10 September 2021. As in CPEX-AW, CPEX-CV will fly the NASA DC-8 medium-altitude aircraft equipped with an suite of remote sensors and dropsonde-launch capability that will allow for the measurement of tropospheric aerosols, winds, temperature, water vapor, and precipitation.
change note: 2022-09-02 11:57:21.0 [sritz] insert Definition (id: null text: NASA’s Convective Processes Experiment – Cabo Verde (CPEX-CV) is a continuation of the truncated CPEX – Aerosols and Winds (CPEX-AW) field program flown out of St. Croix, USVI between 17 August – 10 September 2021. As in CPEX-AW, CPEX-CV will fly the NASA DC-8 medium-altitude aircraft equipped with an suite of remote sensors and dropsonde-launch capability that will allow for the measurement of tropospheric aerosols, winds, temperature, water vapor, and precipitation. language code: en);
change note: 2022-09-02 11:55:04.0 [sritz] Insert Concept add broader relation (CPEX-CV [df7cc2b7-8b91-4b2d-8fd7-14414d89eb25,1040765] - A - C [0c89f3f4-7ab1-43ce-89ee-795d35f0e30a,1033683]);
change note: 2022-09-02 11:55:46.0 [sritz] insert AltLabel (id: null category: primary text: Convective Processes Experiment - Cabo Verde language code: en);
in scheme: projects
type: Concept

A - C
type: Concept