HKTLM
change note: 2018-07-05 07:03:33.0 [mmorahan] insert AltLabel (id: null category: primary text: Housekeeping Telemetry Data used to monitor ENVISAT functions language code: en); insert Definition (id: null text: The ENVISAT Polar Platform generates auxiliary data from the service module, PMC, and instruments that is included in the data stream. The auxiliary data is placed in source packets and transferred to the On-board High Speed Multiplexer to be downlinked with the other low rate instrument data. language code: en);
change note: 2018-07-05 07:01:00.0 [mmorahan] Insert Concept add broader relation (HKTLM [e18c90cb-7dfe-4135-83c8-97a393c1d057,367759] - Recorders/Loggers [ebfff02c-2e5a-476e-aafb-c00167bf2daa,349073]);
in scheme: instruments
definition: The ENVISAT Polar Platform generates auxiliary data from the service module, PMC, and instruments that is included in the data stream. The auxiliary data is placed in source packets and transferred to the On-board High Speed Multiplexer to be downlinked with the other low rate instrument data.
type: Concept

Recorders/Loggers
type: Concept