M - O
type: Concept

MEDALPEX
in scheme: projects
definition: The Mediterranean Alpine Experiment (MEDALPEX) formed an additional part of the Global Atmospheric Research Program (GARP) subprogram on the airflow over and around mountains. MEDALPEX ran concurrently with the Garp Alpine Experiment (ALPEX) - over the year from 1 September 1981 to 30 September 1982 with a special observation period (SOP) from 15 february 1982 to 30 April 1982. The main aim of ALPEX was to study processes such as lee cyclogenesis and severe local winds (for example the Mistral and the Bora), which have two frequency peaks during the year, one in November and the other in April. This was one of the reasons for the SOP in April. The Mediterranean is a deep enclosed sea where tides are small and motion is essentially due to atmospheric forcing. Oceanographic experiments with simultaneous meterological data collection are necessary for a better understanding of the dynamics of the Mediterranean and for setting up well calibrated models. The Mediterranean may also be regarded as a small scale model of the ocean. Thus studies on the dynamics of gyres, fronts, baroclinic instabilities, eddies, turbulent dissipation and intermittancy, especially during storm conditions, can contribute to the understanding of energy transfers in the ocean and its boundaries. The mesoscale eddies and meanders which play an essential role in this circulation, forming the summer thermocline and winter convection may also be studied. All of the above rely heavily on the spatial and temporal aspects of meterological processes. The primary function of MEDALPEX was to study the response of the western part of the Mediterranean to wind forcing. The experiments which took place, often as part of an individual country's oceanographic research program, were designed with the intention of increasing understanding of the general problem of meterological and oceanographic interactions. Specific topics under investigation included: i) the interrelationship between the general circulation a…
type: Concept