HYDRAULIC CONDUCTIVITY
change note: 2017-03-10 09:06:07.0 [tstevens] update Definition (A measure of the readiness with which a liquid, such as water, flows through a solid, such as soil, in response to a given potential gradient.); update Definition (The Nature and Properties of Soils, Prentice Hall, 1996. );
in scheme: sciencekeywords
definition: A measure of the readiness with which a liquid, such as water, flows through a solid, such as soil, in response to a given potential gradient.
type: Concept

SOILS
type: Concept