MACROALGAE (SEAWEEDS)
type: Concept

BROWN ALGAE
in scheme: sciencekeywords
definition: Phylum Ochrophyta. Class Phaeophyceae, brown algae, are distinguished by chloroplasts with four membranes, fucoxanthin pigment and are heterokonts that develop into forms with differentiated tissues.
type: Concept