ACADEMIC
type: Concept

UC-LONDON/SC-PHYS/MSSL
in scheme: providers
definition: Thank you for taking an interest in the Mullard Space Science Laboratory. As the UK's largest university-based space science research group we are proud of our record of achievement over the last 40 years. MSSL delivers a cutting-edge science programme, underpinned by a capability in space science instrumentation, systems engineering and project management. We are also committed to a broad outreach programme and are very happy to receive inquiries from the public and fellow space science professionals alike. Summary Provided By: http://www.mssl.ucl.ac.uk/
type: Concept