OCEAN WAVES
type: Concept

WAVE SPEED/DIRECTION
in scheme: sciencekeywords
definition: Wave speed: Distance a wave travels per time. Wave direction: The line along which a wave travels with respect to its compass heading. Both Wave Speed and Wave Direction may be included as Detailed Variables under Wave Speed/Direction.
type: Concept