Space Station
type: Concept

OSTA-1
change note: 2021-12-01 13:30:54.0 [tstevens] Move Concepts delete broader relation (null); add broader relation (OSTA-1 [e554b6aa-8d53-4fc5-a7d3-e43808d9e41b,826847] - Space Station [a4297e6c-efe4-4194-8309-0b8bd658445b,835934]);
change note: 2021-11-30 12:14:50.0 [tstevens] Move Concepts delete broader relation (null); add broader relation (OSTA-1 [e554b6aa-8d53-4fc5-a7d3-e43808d9e41b,826847] - Space Stations/Crewed Spacecraft [388e72a1-b851-4b78-9e69-747e06ae215f,826132]);
change note: 2021-11-30 09:57:03.0 [tstevens] Move Concepts delete broader relation (null); add broader relation (OSTA-1 [e554b6aa-8d53-4fc5-a7d3-e43808d9e41b,826847] - Space-based Platforms [b39a69b4-c3b9-4a94-b296-bbbbe5e4c847,835875]);
in scheme: platforms
definition: The STS-2 mission was planned as a five day mission, but was cut nearly three days due to the failure of one of three fuel cells that produce electricity and drinking water. However, 90 percent of the mission objectives were still achieved. The flight marked the first time a manned space vehicle had been reflown with a second crew: Commander Joseph Engle and Pilot Richard Truly. It again carried the Development Flight Instrumentation (DFI) package , which contained sensors and measuring devices to record orbiter performance and the stresses that occurred during launch, ascent, orbital flight, descent and landing. Also, onboard were the Office of Space and Terrestrial Applications-1 (OSTA-1) Earth observation experiments mounted on Spacelab pallet in payload bay. These instruments, including the Shuttle Imaging Radar-A (SIR-1), successfully carried out remote sensing of Earth resources, environmental quality, ocean and weather conditions. In addition, the Canadian-built Remote Manipulator System (RMS), a mechanical robot arm located in the payload bay of the Shuttle, was successfully operated for the first time. Additional information available at "http://history.nasa.gov/NP-119/ch1.htm" [Summary provided by NASA]
type: Concept