MBT
in scheme: instruments
definition: The mechanical bathythermograph was the predecessor to the expendable bathythermograph which remains a cornerstone in ships of opportunity sampling today. This instrument was used to obtain continuous tracings of temperature versus depth in the surface layers of the ocean. [Summary provided by NOAA]
type: Concept

Profilers/Sounders
type: Concept