OK-STATE/BIOSYSTEMS
in scheme: providers
definition: The Department of Biosystems and Agricultural Engineering is administered jointly by the College of Agricultural Sciences and Natural Resources and the College of Engineering, Architecture and Technology. Biosystems researchers strive to create and adapt engineering knowledge and technologies for the efficient and effective production, processing, storage, handling and distribution of food, feed, fiber and other biological products, while at the same time providing for a quality environment and preserving and protecting natural resources.
type: Concept

ACADEMIC
type: Concept