DECAPODS
change note: 2017-03-13 14:03:07.0 [mgenazzi] Definition added insert Definition (id: null text: Small ten-footed aquatic crustaceans in Phylum Arthropoda language code: en);
in scheme: sciencekeywords
definition: Small ten-footed aquatic crustaceans in Phylum Arthropoda
type: Concept

CRUSTACEANS
type: Concept