ACADEMIC
type: Concept

UC-BERKELEY/ERG
in scheme: providers
definition: The Energy and Resources Group (ERG) is an interdisciplinary academic unit of the University of California at Berkeley, conducting programs of graduate teaching and research that treat issues of energy, resources, development, human and biological diversity, environmental justice, governance, global climate change and new approaches to thinking about economics and consumption. Website: "http://socrates.berkeley.edu/erg/index.shtml" [Summary provided by the University of California, Berkeley.]
type: Concept