DINOCEANTAR
in scheme: projects
definition: This data set is a dynamic coastal study for determination of the main parameters of the circulation off several coasts and how it changes the nearby seas.
type: Concept

D - F
type: Concept