HABITAT CONVERSION/FRAGMENTATION
type: Concept

URBANIZATION/URBAN SPRAWL
change note: 2012-07-02 15:44:58.0 [tbs1979] update Definition (Princeton University Dictionary); update Definition (Urbanization is the expansion of metropolitan areas by building housing developments and shopping centers farther and farther from urban centers and placing them together with more major highways. An outcome of urbanization is the fact that as more highways are built, surfaces are sealed with pavement, increasing stormwater runoff and quickening concentration times. Urban sprawl refers to the process in which an increasing proportion of an entire population lives in cities or suburbs of cities. Urban sprawl, also known as suburban sprawl, is a multifaceted concept, which includes the spreading outwards of a city and its suburbs to its outskirts to low-density, auto-dependent development on rural land, with associated design features that encourage car dependency.);
change note: 2012-06-27 15:09:55.0 [tbs1979] update PrefLabel (URBANIZATION/URBAN SPRAWL);
change note: 2012-06-27 14:10:12.0 [tbs1979] Move Concepts add broader relation (URBANIZATION [e759cacb-33f0-4564-b151-c7cfa5e85ed3,21607] - HABITAT CONVERSION/FRAGMENTATION [f1682ed1-2d9c-41ec-9553-49b9ab55df9b,20183]); delete broader relation (null);
in scheme: sciencekeywords
definition: Urbanization is the expansion of metropolitan areas by building housing developments and shopping centers farther and farther from urban centers and placing them together with more major highways. An outcome of urbanization is the fact that as more highways are built, surfaces are sealed with pavement, increasing stormwater runoff and quickening concentration times. Urban sprawl refers to the process in which an increasing proportion of an entire population lives in cities or suburbs of cities. Urban sprawl, also known as suburban sprawl, is a multifaceted concept, which includes the spreading outwards of a city and its suburbs to its outskirts to low-density, auto-dependent development on rural land, with associated design features that encourage car dependency.
type: Concept