STS-43
change note: 2021-11-30 12:07:21.0 [tstevens] Move Concepts delete broader relation (null); add broader relation (STS-43 [e771da36-4162-407d-add9-46e6e0e80417,826855] - Space-based Platforms [b39a69b4-c3b9-4a94-b296-bbbbe5e4c847,835875]);
change note: 2021-11-30 12:30:33.0 [tstevens] Move Concepts delete broader relation (null); add broader relation (STS-43 [e771da36-4162-407d-add9-46e6e0e80417,826855] - SPACE SHUTTLE [3ef93fbf-1e19-42a9-a91f-502d125dbb7c,826168]);
change note: 2021-11-30 12:13:24.0 [tstevens] Move Concepts delete broader relation (null); add broader relation (STS-43 [e771da36-4162-407d-add9-46e6e0e80417,826855] - Space Stations/Crewed Spacecraft [388e72a1-b851-4b78-9e69-747e06ae215f,826132]);
definition: Atlantis will put NASA's fourth Tracking and Data Relay Satellite (TDRS-E) into orbit on Space Shuttle mission STS-43 to update the satellite tracking network, resulting in two operating satellites plus a complement of two spares in the space network. TDRS-E, to be deployed from Atlantis about 6 hours after launch, will be boosted to a geosynchronous orbit by an attached upper stage where TDRS-E will be positioned to remain stationary 22,400 miles above the Pacific Ocean southwest of Hawaii. The Tracking and Data Relay Satellite System, in operation since the eighth Space Shuttle flight, provides almost uninterrupted communications with Earth-orbiting shuttles and satellites and has replaced the intermittent coverage provided by globe-encircling ground tracking stations used during the early space program. A reduced string of ground stations remains in operation, however, for radar tracking and backup communications. [Summary provided by NASA] Group: Platform_Details Entry_ID: STS-43 Group: Platform_Identification Platform_Category: Space Stations/Manned Spacecraft Platform_Series_or_Entity: SPACE SHUTTLE Short_Name: STS-43 Long_Name: Space Transport System STS-43 End_Group Group: Synonymous_Platform_Names Short_Name: Atlantis (9) End_Group Group: Orbit Orbit_Altitude: 174nm Orbit_Inclination: 28.45 degrees End_Group Creation_Date: 2008-01-29 Online_Resource: http://science.ksc.nasa.gov/shuttle/missions/sts-43/mission-sts-43.html Sample_Image: http://www.nasa.gov/images/content/134436main_sts-43-crew-sm.jpg Group: Platform_Logistics Launch_Date: 1991-08-02 Launch_Site: Cape Canaveral/Kennedy Space Center, USA Primary_Sponsor: NASA End_Group End_Group
type: Concept
in scheme: platforms

Space Shuttle
type: Concept