REANALYSIS MODELS
change note: 2022-03-11 14:28:41.0 [tstevens] insert Definition (id: null text: Models that deal with the retrospective-analyses or reanalyzes of data. Reanalyzes blend the continuity and breadth of output data of a numerical model with the constraint of vast quantities of observational data. The result is a long-term continuous data record. language code: en);
change note: 2021-11-30 13:23:48.0 [tstevens] Move Concepts delete broader relation (null); add broader relation (REANALYSIS MODELS [e804fb28-786b-460f-969c-7005b0803cde,826856] - Models [0a184cdc-c074-4946-90a6-02f03c686341,835911]);
change note: 2015-08-10 10:41:43.0 [gee-cee] Insert Concept add broader relation (REANALYSIS MODELS [e804fb28-786b-460f-969c-7005b0803cde,158201] - Models/Analyses [113ecbc2-ab36-4d58-a96c-a6ce0106e749,143215]);
in scheme: platforms
definition: Models that deal with the retrospective-analyses or reanalyzes of data. Reanalyzes blend the continuity and breadth of output data of a numerical model with the constraint of vast quantities of observational data. The result is a long-term continuous data record.
type: Concept

Models
type: Concept