MECHANICAL DISTURBANCE
change note: 2022-12-15 08:02:18.0 [tstevens] insert Definition (id: null text: Mechanical disturbances include forest clear-cutting, earth-moving, scraping, chaining, reservoir draw-down, and other similar human-induced changes. language code: en);
change note: 2022-12-15 08:00:58.0 [tstevens] Insert Concept add broader relation (MECHANICAL DISTURBANCE [e84f5068-2123-4594-aa07-bc1389346093,1143778] - ENVIRONMENTAL IMPACTS [3f4cfc81-7745-43d9-b313-f68cdf72359b,1140464]);
in scheme: sciencekeywords
definition: Mechanical disturbances include forest clear-cutting, earth-moving, scraping, chaining, reservoir draw-down, and other similar human-induced changes.
type: Concept

ENVIRONMENTAL IMPACTS
type: Concept