AQUIFER RECHARGE
type: Concept

RECHARGE FREQUENCY
change note: 2016-03-31 10:01:47.0 [gee-cee] insert Definition (id: null text: Number of times water goes through a cycle to be replenished. language code: en);
change note: 2016-03-31 10:01:19.0 [gee-cee] Insert Concept add broader relation (RECHARGE FREQUENCY [e89dc20d-0570-41ca-8039-38316332238a,158779] - AQUIFER RECHARGE [dbeaaf9f-294c-4e45-ba9e-7be8cd449db1,158775]);
in scheme: sciencekeywords
definition: Number of times water goes through a cycle to be replenished.
type: Concept