U-BREMEN/IUP
in scheme: providers
definition: The focus of the Institute of Environmental Physics in environmental physics is the investigation of the atmosphere, the cryosphere, and the oceans of the earth. Part of the IUP is the IFE (Institut für Fernerkundung), which was established to handle our longer-term satellite projects. Website: http://www.iup.physik.uni-bremen.de/ [Summary provided by the University of Bremen.]
type: Concept

ACADEMIC
type: Concept