UWI-GB/NAS
in scheme: providers
definition: NAS is the Department of Natural and Applied Sciences at the University of Wisconsin-Green Bay. This department houses five disciplinary programs of study: Biology, Chemistry, Earth Science, Mathematics, and Physics; an interdisciplinary program of study in Environmental Science; and a pre-professional program of study in Engineering. Summary Provided By: http://www.uwgb.edu/nas/aboutnas.htm
type: Concept

ACADEMIC
type: Concept